Mail Index


[Date Prev][Date Next][Thread Prev][Thread Next][Date Index][Thread Index]

[ApacheGallery] Image::Imlib2 fails when running make test



Hi all,

I pulled down imlib2 v1.1.2 and compiled and installed it.
I pulled down Image-Imlib2-1.07 and compiled it. When I run make test I get the 
following error:

# make test
/usr/bin/perl Build --makefile_env_macros 1 test
t/cache.....NOK 1#     Failed test (t/cache.t at line 8)                     
#     Tried to use 'Image::Imlib2'.
#     Error:  Can't load '/home/wz1gmw/software/ag-perl-mods/Image-Imlib2-
1.07/blib/arch/auto/Image/Imlib2/Imlib2.so' fo
r module Image::Imlib2: libImlib2.so.1: cannot open shared object file: No such 
file or directory at /usr/lib/perl5/5.8.
5/i386-linux-thread-multi/DynaLoader.pm line 230.
#  at (eval 1) line 2
# Compilation failed in require at (eval 1) line 2.
Deep recursion on subroutine "Image::Imlib2::AUTOLOAD" 
at /home/wz1gmw/software/ag-perl-mods/Image-Imlib2-1.07/blib/lib/
Image/Imlib2.pm line 30.
t/cache.....dubious                                                          
        Test returned status 0 (wstat 15, 0xf)
DIED. FAILED tests 1-7
        Failed 7/7 tests, 0.00% okay
t/simple....NOK 1#     Failed test (t/simple.t at line 5)                    
#     Tried to use 'Image::Imlib2'.
#     Error:  Can't load '/home/wz1gmw/software/ag-perl-mods/Image-Imlib2-
1.07/blib/arch/auto/Image/Imlib2/Imlib2.so' fo
r module Image::Imlib2: libImlib2.so.1: cannot open shared object file: No such 
file or directory at /usr/lib/perl5/5.8.
5/i386-linux-thread-multi/DynaLoader.pm line 230.
#  at (eval 1) line 2
# Compilation failed in require at (eval 1) line 2.
Deep recursion on subroutine "Image::Imlib2::AUTOLOAD" 
at /home/wz1gmw/software/ag-perl-mods/Image-Imlib2-1.07/blib/lib/
Image/Imlib2.pm line 30.
t/simple....dubious                                                          
        Test returned status 0 (wstat 15, 0xf)
DIED. FAILED tests 1-12
        Failed 12/12 tests, 0.00% okay
Failed Test Stat Wstat Total Fail  Failed  List of Failed
-------------------------------------------------------------------------------
t/cache.t      0    15     7   13 185.71%  1-7
t/simple.t     0    15    12   23 191.67%  1-12
Failed 2/2 test scripts, 0.00% okay. 19/19 subtests failed, 0.00% okay.
make: *** [test] Error 255
#


All suggestions would be greatly appreciated.

Asar
_______________________________________________
users mailing list
[email protected]
http://ufo.hestdesign.com/cgi-bin/mailman/listinfo/agusers