Mail Index


[Date Prev][Date Next][Thread Prev][Thread Next][Date Index][Thread Index]

[ApacheGallery] make test fails



Hi,

Any ideas as to why 'make test' issues the following errors/warnings:
(perl -v ==> This is perl, v5.8.2 built for i686-linux)

make test
PERL_DL_NONLAZY=1 /usr/local/bin/perl "-MExtUtils::Command::MM" "-e" "test_harness(0, 'blib/lib', 'blib/arch')" t/*.t t/001_use...........Useless use of private variable in void context at /usr/local/src/Apache-Gallery-0.9.1/blib/lib/Apache/Gallery.pm line 1423.
t/001_use...........ok
t/002_graphlibs.....Useless use of private variable in void context at /usr/local/src/Apache-Gallery-0.9.1/blib/lib/Apache/Gallery.pm line 1423. Image::Imlib2 load error: No loader for file format at /usr/local/src/Apache-Gallery-0.9.1/blib/lib/Apache/Gallery.pm line 1362.
# Looks like your test died before it could output anything.
t/002_graphlibs.....dubious
        Test returned status 255 (wstat 65280, 0xff00)
DIED. FAILED tests 1-4
        Failed 4/4 tests, 0.00% okay
t/003_comment.......Useless use of private variable in void context at /usr/local/src/Apache-Gallery-0.9.1/blib/lib/Apache/Gallery.pm line 1423.
t/003_comment.......ok
t/004_cache_dir.....Useless use of private variable in void context at /usr/local/src/Apache-Gallery-0.9.1/blib/lib/Apache/Gallery.pm line 1423.
t/004_cache_dir.....ok
t/005_imageinfo.....Useless use of private variable in void context at /usr/local/src/Apache-Gallery-0.9.1/blib/lib/Apache/Gallery.pm line 1423.
t/005_imageinfo.....ok
t/006_thumbnails....Useless use of private variable in void context at /usr/local/src/Apache-Gallery-0.9.1/blib/lib/Apache/Gallery.pm line 1423.
t/006_thumbnails....ok
t/007_pod...........#     Failed test (t/007_pod.t at line 17)
# blib/lib/Apache/Gallery.pm (1714): You forgot a '=back' before '=head1'
# Looks like you failed 1 tests of 1.
t/007_pod...........dubious
        Test returned status 1 (wstat 256, 0x100)
DIED. FAILED test 1
        Failed 1/1 tests, 0.00% okay
Failed Test       Stat Wstat Total Fail  Failed  List of Failed
-------------------------------------------------------------------------------
t/002_graphlibs.t  255 65280     4    8 200.00%  1-4
t/007_pod.t          1   256     1    1 100.00%  1
Failed 2/7 test scripts, 71.43% okay. 5/21 subtests failed, 76.19% okay.
make: *** [test_dynamic] Error 2
Thanks in advance - Angus

_______________________________________________
users mailing list
[email protected]
http://ufo.hestdesign.com/cgi-bin/mailman/listinfo/agusers