Mail Index


[Date Prev][Date Next][Thread Prev][Thread Next][Date Index][Thread Index]

Re: [ApacheGallery] Apache::Gallery 'make test' fails on RedHat Fedora Core 2



with latest snapshot from svn (r264) it tells something about method "request" via package "Apache" but CGI is installed and apache-request only is for apache 1.x with mod_perl <1.99:

 make test
PERL_DL_NONLAZY=1 /usr/bin/perl "-MExtUtils::Command::MM" "-e" "test_harness(0, 'blib/lib', 'blib/arch')" t/*.t t/001_use...........Useless use of private variable in void context at /root/apachegallery/blib/lib/Apache/Gallery.pm line 1415.
t/001_use...........ok
t/002_graphlibs.....Useless use of private variable in void context at /root/apachegallery/blib/lib/Apache/Gallery.pm line 1415. Can't locate object method "request" via package "Apache" at /root/apachegallery/blib/lib/Apache/Gallery.pm line 1415.
# Looks like your test died before it could output anything.
t/002_graphlibs.....dubious
        Test returned status 255 (wstat 65280, 0xff00)
Scalar found where operator expected at (eval 152) line 1, near "'int' $__val"
        (Missing operator before   $__val?)
DIED. FAILED tests 1-4
        Failed 4/4 tests, 0.00% okay
t/003_comment.......Useless use of private variable in void context at /root/apachegallery/blib/lib/Apache/Gallery.pm line 1415.
t/003_comment.......ok
t/004_cache_dir.....Useless use of private variable in void context at /root/apachegallery/blib/lib/Apache/Gallery.pm line 1415.
t/004_cache_dir.....ok
        8/8 skipped: Test::MockObject not found
t/005_imageinfo.....Useless use of private variable in void context at /root/apachegallery/blib/lib/Apache/Gallery.pm line 1415.
skipped
        all skipped: skip Apache::FakeRequest not found
t/006_thumbnails....Useless use of private variable in void context at /root/apachegallery/blib/lib/Apache/Gallery.pm line 1415.
skipped
        all skipped: skip because Test::MockObject not found
t/007_pod...........skipped
        all skipped: Test::Pod v0.95 required for testing POD
Failed Test       Stat Wstat Total Fail  Failed  List of Failed
-------------------------------------------------------------------------------
t/002_graphlibs.t  255 65280     4    8 200.00%  1-4
3 tests and 8 subtests skipped.
Failed 1/7 test scripts, 85.71% okay. 4/15 subtests failed, 73.33% okay.
make: *** [test_dynamic] Fehler 255



when trying to install via CPAN it shows the same output as yesterday and doesn't say anything about missing dependencies:

> perl -MCPAN -e shell
Terminal does not support AddHistory.

cpan shell -- CPAN exploration and modules installation (v1.7601)
ReadLine support available (try 'install Bundle::CPAN')

cpan> install Apache::Gallery
CPAN: Storable loaded ok
Going to read /root/.cpan/Metadata
  Database was generated on Wed, 11 Aug 2004 09:04:36 GMT
Running install for module Apache::Gallery
Running make for L/LE/LEGART/Apache-Gallery-0.8.tar.gz
CPAN: Digest::MD5 loaded ok
Checksum for /root/.cpan/sources/authors/id/L/LE/LEGART/Apache-Gallery-0.8.tar.gz ok
Scanning cache /root/.cpan/build for sizes
Apache-Gallery-0.8/
Apache-Gallery-0.8/templates/
Apache-Gallery-0.8/templates/default/
Apache-Gallery-0.8/templates/default/scaleactive.tpl
Apache-Gallery-0.8/templates/default/refresh.tpl
Apache-Gallery-0.8/templates/default/nopictureinfo.tpl
Apache-Gallery-0.8/templates/default/index.tpl
Apache-Gallery-0.8/templates/default/orig.tpl
Apache-Gallery-0.8/templates/default/slideshowoff.tpl
Apache-Gallery-0.8/templates/default/directory.tpl
Apache-Gallery-0.8/templates/default/file.tpl
Apache-Gallery-0.8/templates/default/gallery.css
Apache-Gallery-0.8/templates/default/navpicture.tpl
Apache-Gallery-0.8/templates/default/dircomment.tpl
Apache-Gallery-0.8/templates/default/interval.tpl
Apache-Gallery-0.8/templates/default/layout.tpl
Apache-Gallery-0.8/templates/default/showpicture.tpl
Apache-Gallery-0.8/templates/default/error.tpl
Apache-Gallery-0.8/templates/default/pictureinfo.tpl
Apache-Gallery-0.8/templates/default/intervalactive.tpl
Apache-Gallery-0.8/templates/default/info.tpl
Apache-Gallery-0.8/templates/default/nodircomment.tpl
Apache-Gallery-0.8/templates/default/picture.tpl
Apache-Gallery-0.8/templates/default/scale.tpl
Apache-Gallery-0.8/templates/default/slideshowisoff.tpl
Apache-Gallery-0.8/templates/new/
Apache-Gallery-0.8/templates/new/nopictureinfo.tpl
Apache-Gallery-0.8/templates/new/slideshowisoff.tpl
Apache-Gallery-0.8/templates/new/index.tpl
Apache-Gallery-0.8/templates/new/refresh.tpl
Apache-Gallery-0.8/templates/new/slideshowoff.tpl
Apache-Gallery-0.8/templates/new/layout.tpl
Apache-Gallery-0.8/templates/new/orig.tpl
Apache-Gallery-0.8/templates/new/dircomment.tpl
Apache-Gallery-0.8/templates/new/showpicture.tpl
Apache-Gallery-0.8/templates/new/info.tpl
Apache-Gallery-0.8/templates/new/scaleactive.tpl
Apache-Gallery-0.8/templates/new/error.tpl
Apache-Gallery-0.8/templates/new/file.tpl
Apache-Gallery-0.8/templates/new/interval.tpl
Apache-Gallery-0.8/templates/new/directory.tpl
Apache-Gallery-0.8/templates/new/picture.tpl
Apache-Gallery-0.8/templates/new/intervalactive.tpl
Apache-Gallery-0.8/templates/new/navpicture.tpl
Apache-Gallery-0.8/templates/new/pictureinfo.tpl
Apache-Gallery-0.8/templates/new/gallery.css
Apache-Gallery-0.8/templates/new/nodircomment.tpl
Apache-Gallery-0.8/templates/new/scale.tpl
Apache-Gallery-0.8/htdocs/
Apache-Gallery-0.8/htdocs/application-doc.png
Apache-Gallery-0.8/htdocs/agfolder.png
Apache-Gallery-0.8/htdocs/application-pdf.png
Apache-Gallery-0.8/htdocs/video-mov.png
Apache-Gallery-0.8/htdocs/video-mpg.png
Apache-Gallery-0.8/htdocs/sound-wav.png
Apache-Gallery-0.8/htdocs/c.png
Apache-Gallery-0.8/htdocs/sound-ogg.png
Apache-Gallery-0.8/htdocs/video-wmv.png
Apache-Gallery-0.8/htdocs/sound-mp3.png
Apache-Gallery-0.8/htdocs/video-mpeg.png
Apache-Gallery-0.8/htdocs/application-rtf.png
Apache-Gallery-0.8/htdocs/video-avi.png
Apache-Gallery-0.8/htdocs/video-asf.png
Apache-Gallery-0.8/t/
Apache-Gallery-0.8/t/003_commenttest
Apache-Gallery-0.8/t/003_comment.t
Apache-Gallery-0.8/t/007_pod.t
Apache-Gallery-0.8/t/002_graphlibs.t
Apache-Gallery-0.8/t/006_thumbnails.t
Apache-Gallery-0.8/t/004_cache_dir.t
Apache-Gallery-0.8/t/002_injpg.jpg
Apache-Gallery-0.8/t/002_inpng.png
Apache-Gallery-0.8/t/005_jpg.jpg
Apache-Gallery-0.8/t/001_use.t
Apache-Gallery-0.8/t/005_imageinfo.t
Apache-Gallery-0.8/Changes
Apache-Gallery-0.8/MANIFEST
Apache-Gallery-0.8/TODO
Apache-Gallery-0.8/UPGRADE
Apache-Gallery-0.8/LICENSE
Apache-Gallery-0.8/README
Apache-Gallery-0.8/META.yml
Apache-Gallery-0.8/lib/
Apache-Gallery-0.8/lib/Apache/
Apache-Gallery-0.8/lib/Apache/Gallery.pm
Apache-Gallery-0.8/INSTALL
Apache-Gallery-0.8/Makefile.PL
Removing previously used /root/.cpan/build/Apache-Gallery-0.8

  CPAN.pm: Going to build L/LE/LEGART/Apache-Gallery-0.8.tar.gz

Checking if your kit is complete...
Looks good
Writing Makefile for Apache::Gallery
cp lib/Apache/Gallery.pm blib/lib/Apache/Gallery.pm
Manifying blib/man3/Apache::Gallery.3pm
  /usr/bin/make  -- OK
Running make test
PERL_DL_NONLAZY=1 /usr/bin/perl "-MExtUtils::Command::MM" "-e" "test_harness(0, 'blib/lib', 'blib/arch')" t/*.t t/001_use...........Useless use of private variable in void context at /root/.cpan/build/Apache-Gallery-0.8/blib/lib/Apache/Gallery.pm line 1364.
t/001_use...........ok
t/002_graphlibs.....Useless use of private variable in void context at /root/.cpan/build/Apache-Gallery-0.8/blib/lib/Apache/Gallery.pm line 1364. Unable to open file t/002_injpg.jpg, at /root/.cpan/build/Apache-Gallery-0.8/blib/lib/Apache/Gallery.pm line 1303. Can't call method "create_scaled_image" on an undefined value at /root/.cpan/build/Apache-Gallery-0.8/blib/lib/Apache/Gallery.pm line 1306.
# Looks like your test died before it could output anything.
t/002_graphlibs.....dubious
        Test returned status 255 (wstat 65280, 0xff00)
Scalar found where operator expected at (eval 152) line 1, near "'int' $__val"
        (Missing operator before   $__val?)
DIED. FAILED tests 1-4
        Failed 4/4 tests, 0.00% okay
t/003_comment.......Useless use of private variable in void context at /root/.cpan/build/Apache-Gallery-0.8/blib/lib/Apache/Gallery.pm line 1364.
t/003_comment.......ok
t/004_cache_dir.....Useless use of private variable in void context at /root/.cpan/build/Apache-Gallery-0.8/blib/lib/Apache/Gallery.pm line 1364.
t/004_cache_dir.....ok
        8/8 skipped: Test::MockObject not found
t/005_imageinfo.....Useless use of private variable in void context at /root/.cpan/build/Apache-Gallery-0.8/blib/lib/Apache/Gallery.pm line 1364.
skipped
        all skipped: skip Apache::FakeRequest not found
t/006_thumbnails....Useless use of private variable in void context at /root/.cpan/build/Apache-Gallery-0.8/blib/lib/Apache/Gallery.pm line 1364.
skipped
        all skipped: skip because Test::MockObject not found
t/007_pod...........skipped
        all skipped: Test::Pod v0.95 required for testing POD
Failed Test       Stat Wstat Total Fail  Failed  List of Failed
-------------------------------------------------------------------------------
t/002_graphlibs.t  255 65280     4    8 200.00%  1-4
3 tests and 8 subtests skipped.
Failed 1/7 test scripts, 85.71% okay. 4/15 subtests failed, 73.33% okay.
make: *** [test_dynamic] Fehler 255
  /usr/bin/make test -- NOT OK
Running make install
  make test had returned bad status, won't install without force

cpan> exit
Terminal does not support GetHistory.
Lockfile removed.


Anybody has an Idea what went wrong?
_______________________________________________
users mailing list
[email protected]
http://ufo.hestdesign.com/cgi-bin/mailman/listinfo/agusers